Reaction Details
TargetDNA polymerase alpha catalytic subunit
LigandBDBM50184753
Substrate/Competitorn/a
Meas. Tech.ChEMBL_356787 (CHEMBL861140)
IC50>12500±n/a nM
Citation Doncaster, JREtchells, LLKershaw, NMNakamura, RRyan, HTakeuchi, RSakaguchi, KSardarian, AWhitehead, RC Synthetic analogues of the manzamenones and plakoridines which inhibit DNA polymerase. Bioorg Med Chem Lett16:2877-81 (2006) 
 
DNA polymerase alpha catalytic subunit
Name:DNA polymerase alpha catalytic subunit
Type:PROTEIN
Mol. Mass.:165895.25
Organism:Homo sapiens (Human)
Description:ChEMBL_1365493
Residue:1462
BDBM50184753
NameBDBM50184753
Synonyms:(1R,1bR,2R,5S,5aS)-1a,3-dihexadecyl-6-oxo-1a,1b,2,5,5a,6-hexahydro-1H-cyclopropa[a]indene-2,5,6a-tricarboxylic acid trimethyl ester | CHEMBL207165
TypeSmall organic molecule
Emp. Form.C48H82O7
Mol. Mass.771.1605
1=C[C@@H]([C@@H]2[C@H]([C@H]1C(=O)OC)[C@@]1(CCCCCCCCCCCCCCCC)C[C@@]1(C(=O)OC)C2=O)C(=O)OC