Reaction Details
TargetDNA nucleotidylexotransferase
LigandBDBM50184755
Substrate/Competitorn/a
Meas. Tech.ChEMBL_356789 (CHEMBL861142)
IC50 2500±n/a nM
Citation Doncaster, JREtchells, LLKershaw, NMNakamura, RRyan, HTakeuchi, RSakaguchi, KSardarian, AWhitehead, RC Synthetic analogues of the manzamenones and plakoridines which inhibit DNA polymerase. Bioorg Med Chem Lett16:2877-81 (2006) 
 
DNA nucleotidylexotransferase
Name:DNA nucleotidylexotransferase
Type:PROTEIN
Mol. Mass.:58545.66
Organism:Homo sapiens (Human)
Description:ChEMBL_210231
Residue:509
BDBM50184755
NameBDBM50184755
Synonyms:(3aS,4S,7R,7aR)-1,6-dihexadecyl-2,7-bis(methoxycarbonyl)-3-oxo-3a,4,7,7a-tetrahydro-3H-indene-4-carboxylic acid | CHEMBL380892
TypeSmall organic molecule
Emp. Form.C46H78O7
Mol. Mass.743.1073
1=C(C(=O)OC)C(=O)[C@H]2[C@@H]1[C@@H](C(=O)OC)C(CCCCCCCCCCCCCCCC)=C[C@@H]2C(O)=O