Reaction Details
TargetDNA polymerase alpha catalytic subunit
LigandBDBM50143526
Substrate/Competitorn/a
Meas. Tech.ChEMBL_356787 (CHEMBL861140)
IC50 4300±n/a nM
Citation Doncaster, JREtchells, LLKershaw, NMNakamura, RRyan, HTakeuchi, RSakaguchi, KSardarian, AWhitehead, RC Synthetic analogues of the manzamenones and plakoridines which inhibit DNA polymerase. Bioorg Med Chem Lett16:2877-81 (2006) 
 
DNA polymerase alpha catalytic subunit
Name:DNA polymerase alpha catalytic subunit
Type:PROTEIN
Mol. Mass.:165895.25
Organism:Homo sapiens (Human)
Description:ChEMBL_1365493
Residue:1462
BDBM50143526
NameBDBM50143526
Synonyms:CHEMBL366792 | Untenone A
TypeSmall organic molecule
Emp. Form.C23H40O4
Mol. Mass.380.5613
[C@]1(O)C=CC(=O)[C@H]1C(=O)OC