Reaction Details
TargetDNA nucleotidylexotransferase
LigandBDBM50184750
Substrate/Competitorn/a
Meas. Tech.ChEMBL_356789 (CHEMBL861142)
IC50>50000±n/a nM
Citation Doncaster, JREtchells, LLKershaw, NMNakamura, RRyan, HTakeuchi, RSakaguchi, KSardarian, AWhitehead, RC Synthetic analogues of the manzamenones and plakoridines which inhibit DNA polymerase. Bioorg Med Chem Lett16:2877-81 (2006) 
 
DNA nucleotidylexotransferase
Name:DNA nucleotidylexotransferase
Type:PROTEIN
Mol. Mass.:58545.66
Organism:Homo sapiens (Human)
Description:ChEMBL_210231
Residue:509
BDBM50184750
NameBDBM50184750
Synonyms:(2R,3S,4R)-4-hydroxy-5-[2-oxo-nonadec-ylidene]-1-phenethyl-2-phenyl-pyrrolidine-3-carboxylic acid methyl ester | CHEMBL381375
TypeSmall organic molecule
Emp. Form.C39H57NO4
Mol. Mass.603.8742
(=O)C=C1[C@H](O)[C@H]([C@@H](N1CCc1ccccc1)c1ccccc1)C(=O)OC