Reaction Details
TargetDNA polymerase beta
LigandBDBM50184758
Substrate/Competitorn/a
Meas. Tech.ChEMBL_356788 (CHEMBL861141)
IC50 2300±n/a nM
Citation Doncaster, JREtchells, LLKershaw, NMNakamura, RRyan, HTakeuchi, RSakaguchi, KSardarian, AWhitehead, RC Synthetic analogues of the manzamenones and plakoridines which inhibit DNA polymerase. Bioorg Med Chem Lett16:2877-81 (2006) 
 
DNA polymerase beta
Name:DNA polymerase beta
Type:Protein
Mol. Mass.:38188.76
Organism:Homo sapiens (Human)
Description:n/a
Residue:335
BDBM50184758
NameBDBM50184758
Synonyms:(3aS,4S,7R,7aR)-1,6-didodecyl-2,7-bis(methoxycarbonyl)-3-oxo-3a,4,7,7a-tetrahydro-3H-indene-4-carboxylic acid | CHEMBL210047
TypeSmall organic molecule
Emp. Form.C38H62O7
Mol. Mass.630.8947
SMILESCCCCCCCCCCCCC1=C(C(=O)OC)C(=O)[C@H]2[C@@H]1[C@@H](C(=O)OC)C(CCCCCCCCCCCC)=C[C@@H]2C(O)=O