Reaction Details
TargetDNA nucleotidylexotransferase
LigandBDBM50184759
Substrate/Competitorn/a
Meas. Tech.ChEMBL_356789 (CHEMBL861142)
IC50>50000±n/a nM
Citation Doncaster, JREtchells, LLKershaw, NMNakamura, RRyan, HTakeuchi, RSakaguchi, KSardarian, AWhitehead, RC Synthetic analogues of the manzamenones and plakoridines which inhibit DNA polymerase. Bioorg Med Chem Lett16:2877-81 (2006) 
 
DNA nucleotidylexotransferase
Name:DNA nucleotidylexotransferase
Type:PROTEIN
Mol. Mass.:58545.66
Organism:Homo sapiens (Human)
Description:ChEMBL_210231
Residue:509
BDBM50184759
NameBDBM50184759
Synonyms:(2R,3S,4R)-methyl 1-(2-(1H-indol-3-yl)ethyl)-4-hydroxy-5-(2-oxotetradecylidene)-2-phenylpyrrolidine-3-carboxylate | CHEMBL437310
TypeSmall organic molecule
Emp. Form.C36H48N2O4
Mol. Mass.572.7773
SMILESCCCCCCCCCCCCC(=O)C=C1[C@H](O)[C@H]([C@@H](N1CCc1c[nH]c2ccccc12)c1ccccc1)C(=O)OC