Reaction Details
TargetAryl hydrocarbon receptor
LigandBDBM50603538
Substrate/Competitorn/a
Meas. Tech.ChEMBL_2244281 (CHEMBL5158491)
EC50 0.270000±n/a nM
Citation Tian, CZhang, GXia, ZChen, NYang, SLi, L Identification of triazolopyridine derivatives as a new class of AhR agonists and evaluation of anti-psoriasis effect in a mouse model. Eur J Med Chem231:0 (2022) 
 
Aryl hydrocarbon receptor
Name:Aryl hydrocarbon receptor
Type:PROTEIN
Mol. Mass.:96143.77
Organism:Homo sapiens (Human)
Description:ChEMBL_1503828
Residue:848
BDBM50603538
NameBDBM50603538
Synonyms:CHEMBL5190861
TypeSmall organic molecule
Emp. Form.C12H7Br2N3O
Mol. Mass.369.011
SMILES[O-][n+]1c(nc2ccc(Br)cn12)-c1ccc(Br)cc1