Reaction Details
TargetAryl hydrocarbon receptor
LigandBDBM50603542
Substrate/Competitorn/a
Meas. Tech.ChEMBL_2244281 (CHEMBL5158491)
EC50 77±n/a nM
Citation Tian, CZhang, GXia, ZChen, NYang, SLi, L Identification of triazolopyridine derivatives as a new class of AhR agonists and evaluation of anti-psoriasis effect in a mouse model. Eur J Med Chem231:0 (2022) 
 
Aryl hydrocarbon receptor
Name:Aryl hydrocarbon receptor
Type:PROTEIN
Mol. Mass.:96143.77
Organism:Homo sapiens (Human)
Description:ChEMBL_1503828
Residue:848
BDBM50603542
NameBDBM50603542
Synonyms:CHEMBL5183442
TypeSmall organic molecule
Emp. Form.C13H7BrN4O
Mol. Mass.315.125
SMILES[O-][n+]1c(nc2ccc(cn12)C#N)-c1ccc(Br)cc1