Reaction Details
TargetAryl hydrocarbon receptor
LigandBDBM50603546
Substrate/Competitorn/a
Meas. Tech.ChEMBL_2244281 (CHEMBL5158491)
EC50 83±n/a nM
Citation Tian, CZhang, GXia, ZChen, NYang, SLi, L Identification of triazolopyridine derivatives as a new class of AhR agonists and evaluation of anti-psoriasis effect in a mouse model. Eur J Med Chem231:0 (2022) 
 
Aryl hydrocarbon receptor
Name:Aryl hydrocarbon receptor
Type:PROTEIN
Mol. Mass.:96143.77
Organism:Homo sapiens (Human)
Description:ChEMBL_1503828
Residue:848
BDBM50603546
NameBDBM50603546
Synonyms:CHEMBL5207451
TypeSmall organic molecule
Emp. Form.C12H7BrFN3O
Mol. Mass.308.106
SMILES[O-][n+]1c(nc2cc(F)ccn12)-c1ccc(Br)cc1