Reaction Details
TargetAryl hydrocarbon receptor
LigandBDBM50603555
Substrate/Competitorn/a
Meas. Tech.ChEMBL_2244281 (CHEMBL5158491)
EC50 9.6±n/a nM
Citation Tian, CZhang, GXia, ZChen, NYang, SLi, L Identification of triazolopyridine derivatives as a new class of AhR agonists and evaluation of anti-psoriasis effect in a mouse model. Eur J Med Chem231:0 (2022) 
 
Aryl hydrocarbon receptor
Name:Aryl hydrocarbon receptor
Type:PROTEIN
Mol. Mass.:96143.77
Organism:Homo sapiens (Human)
Description:ChEMBL_1503828
Residue:848
BDBM50603555
NameBDBM50603555
Synonyms:CHEMBL5199691
TypeSmall organic molecule
Emp. Form.C12H7Br2N3
Mol. Mass.353.012
SMILESBrc1cccc(c1)-c1nc2ccc(Br)cn2n1