Reaction Details
TargetAryl hydrocarbon receptor
LigandBDBM50603563
Substrate/Competitorn/a
Meas. Tech.ChEMBL_2244281 (CHEMBL5158491)
EC50 23±n/a nM
Citation Tian, CZhang, GXia, ZChen, NYang, SLi, L Identification of triazolopyridine derivatives as a new class of AhR agonists and evaluation of anti-psoriasis effect in a mouse model. Eur J Med Chem231:0 (2022) 
 
Aryl hydrocarbon receptor
Name:Aryl hydrocarbon receptor
Type:PROTEIN
Mol. Mass.:96143.77
Organism:Homo sapiens (Human)
Description:ChEMBL_1503828
Residue:848
BDBM50603563
NameBDBM50603563
Synonyms:CHEMBL5198934
TypeSmall organic molecule
Emp. Form.C13H7BrN4
Mol. Mass.299.125
SMILESBrc1ccc(cc1)-c1nc2ccc(cn2n1)C#N