Reaction Details
TargetMelanin-concentrating hormone receptor 1
LigandBDBM50184923
Substrate/Competitorn/a
Meas. Tech.ChEMBL_342542 (CHEMBL861585)
Ki 2.5±n/a nM
Citation McBriar, MDGuzik, HShapiro, SParuchova, JXu, RPalani, AClader, JWCox, KGreenlee, WJHawes, BEKowalski, TJO'neill, KSpar, BDWeig, BWeston, DJFarley, CCook, J Discovery of orally efficacious melanin-concentrating hormone receptor-1 antagonists as antiobesity agents. Synthesis, SAR, and biological evaluation of bicyclo[3.1.0]hexyl ureas. J Med Chem49:2294-310 (2006) 
 
Melanin-concentrating hormone receptor 1
Name:Melanin-concentrating hormone receptor 1
Type:G Protein-Coupled Receptor (GPCR)
Mol. Mass.:45976.27
Organism:Homo sapiens (Human)
Description:Membranes from CHO-K1 cells stably expressing human MCH1R were used in assays.
Residue:422
BDBM50184923
NameBDBM50184923
Synonyms:1-((1S,2R,5S)-5-(3-acetamidophenyl)bicyclo[3.1.0]hexan-2-yl)-3-(3-chloro-4-fluorophenyl)-1-(3-(4-methylpiperazin-1-yl)propyl)urea N-[3-[trans-4-[[[(3-chloro-4-fluorophenyl)amino]carbonyl][3-(4-methyl-1-piperazinyl)propyl]amino]bicyclo[3.1.0]hex-1-yl]-phenyl]acetamide
TypeSmall organic molecule
Emp. Form.C29H37ClFN5O2
Mol. Mass.542.088
SMILESCN1CCN(CCCN([C@@H]2CC[C@@]3(C[C@H]23)c2cccc(NC(C)=O)c2)C(=O)Nc2ccc(F)c(Cl)c2)CC1