Reaction Details
TargetMelanin-concentrating hormone receptor 1
LigandBDBM50184924
Substrate/Competitorn/a
Meas. Tech.ChEMBL_342542 (CHEMBL861585)
Ki 2.7±n/a nM
Citation McBriar, MDGuzik, HShapiro, SParuchova, JXu, RPalani, AClader, JWCox, KGreenlee, WJHawes, BEKowalski, TJO'neill, KSpar, BDWeig, BWeston, DJFarley, CCook, J Discovery of orally efficacious melanin-concentrating hormone receptor-1 antagonists as antiobesity agents. Synthesis, SAR, and biological evaluation of bicyclo[3.1.0]hexyl ureas. J Med Chem49:2294-310 (2006) 
 
Melanin-concentrating hormone receptor 1
Name:Melanin-concentrating hormone receptor 1
Type:G Protein-Coupled Receptor (GPCR)
Mol. Mass.:45976.27
Organism:Homo sapiens (Human)
Description:Membranes from CHO-K1 cells stably expressing human MCH1R were used in assays.
Residue:422
BDBM50184924
NameBDBM50184924
Synonyms:1-((1S,2R,5S)-5-(4-cyanophenyl)bicyclo[3.1.0]hexan-2-yl)-3-(4-fluoro-3-(trifluoromethyl)phenyl)-1-(3-(4-methylpiperazin-1-yl)propyl)urea N-[trans-5-(4-cyanophenyl)bicyclo[3.1.0]hex-2-yl]-N'-[4-fluoro-3-(trifluoromethyl)phenyl)-N-[3-(4-methyl-1-piperazinyl)propyl]-urea
TypeSmall organic molecule
Emp. Form.C29H33F4N5O
Mol. Mass.543.5988
SMILESCN1CCN(CCCN([C@@H]2CC[C@@]3(C[C@H]23)c2ccc(cc2)C#N)C(=O)Nc2ccc(F)c(c2)C(F)(F)F)CC1