Reaction Details
TargetMelanin-concentrating hormone receptor 1
LigandBDBM50184935
Substrate/Competitorn/a
Meas. Tech.ChEMBL_342542 (CHEMBL861585)
Ki 2±n/a nM
Citation McBriar, MDGuzik, HShapiro, SParuchova, JXu, RPalani, AClader, JWCox, KGreenlee, WJHawes, BEKowalski, TJO'neill, KSpar, BDWeig, BWeston, DJFarley, CCook, J Discovery of orally efficacious melanin-concentrating hormone receptor-1 antagonists as antiobesity agents. Synthesis, SAR, and biological evaluation of bicyclo[3.1.0]hexyl ureas. J Med Chem49:2294-310 (2006) 
 
Melanin-concentrating hormone receptor 1
Name:Melanin-concentrating hormone receptor 1
Type:G Protein-Coupled Receptor (GPCR)
Mol. Mass.:45976.27
Organism:Homo sapiens (Human)
Description:Membranes from CHO-K1 cells stably expressing human MCH1R were used in assays.
Residue:422
BDBM50184935
NameBDBM50184935
Synonyms:3-(3-chloro-4-fluorophenyl)-1-(3-(4-methylpiperazin-1-yl)propyl)-1-((1S,2R,5S)-5-(pyridin-3-yl)bicyclo[3.1.0]hexan-2-yl)urea N'-(3-chloro-4-fluorophenyl)-N-[3-(4-methyl-1-piperazinyl)-propyl]-N-[trans-5-(3-pyridinyl)bicyclo[3.1.0]hex-2-yl]urea
TypeSmall organic molecule
Emp. Form.C26H33ClFN5O
Mol. Mass.486.025
SMILESCN1CCN(CCCN([C@@H]2CC[C@@]3(C[C@H]23)c2cccnc2)C(=O)Nc2ccc(F)c(Cl)c2)CC1