Reaction Details
TargetFatty-acid amide hydrolase 1 [30-579]
LigandBDBM50185011
Substrate/Competitorn/a
Meas. Tech.ChEMBL_342906 (CHEMBL868830)
IC50>50000±n/a nM
Citation Schiano Moriello, ABalas, LLigresti, ACascio, MGDurand, TMorera, EOrtar, GDi Marzo, V Development of the first potential covalent inhibitors of anandamide cellular uptake. J Med Chem49:2320-32 (2006) 
 
Fatty-acid amide hydrolase 1 [30-579]
Name:Fatty-acid amide hydrolase 1 [30-579]
Type:Single-pass membrane protein; homodimer
Mol. Mass.:60474.00
Organism:Rattus norvegicus (rat)
Description:P97612 (aa 30-579)
Residue:550
BDBM50185011
NameBDBM50185011
Synonyms:(Z)-N-[(1S)-2-hydroxy-1-[(4-hydroxyphenyl)methyl]ethyl]-12-(benzoyloxy)-9-dodecenamide | CHEMBL206715
TypeSmall organic molecule
Emp. Form.C28H37NO5
Mol. Mass.467.5971
SMILESOC[C@H](Cc1ccc(O)cc1)NC(=O)CCCCCCC\C=C/CCOC(=O)c1ccccc1