Reaction Details
Target5-hydroxytryptamine receptor 2A
LigandBDBM50185781
Substrate/Competitorn/a
Meas. Tech.ChEMBL_361713 (CHEMBL861444)
Ki 1.7±n/a nM
Citation Ladduwahetty, TBoase, ALMitchinson, AQuin, CPatel, SChapman, KMacLeod, AM A new class of selective, non-basic 5-HT2A receptor antagonists. Bioorg Med Chem Lett16:3201-4 (2006) 
 
5-hydroxytryptamine receptor 2A
Name:5-hydroxytryptamine receptor 2A
Type:undefined
Mol. Mass.:52607.65
Organism:Homo sapiens (Human)
Description:P28223
Residue:471
BDBM50185781
NameBDBM50185781
Synonyms:4-(2,4-difluorophenethyl)-1-(2-(naphthalen-1-yl)phenylsulfonyl)piperidine | CHEMBL206308
TypeSmall organic molecule
Emp. Form.C29H27F2NO2S
Mol. Mass.491.592
SMILESFc1ccc(CCC2CCN(CC2)S(=O)(=O)c2ccccc2-c2cccc3ccccc23)c(F)c1