Reaction Details
TargetMatrix metalloproteinase-9
LigandBDBM50185883
Substrate/Competitorn/a
Meas. Tech.ChEMBL_361727 (CHEMBL870165)
IC50 1.4±n/a nM
Citation Zhang, YMFan, XXiang, BChakravarty, DScannevin, RBurke, SKarnachi, PRhodes, KJackson, P Synthesis and SAR of alpha-sulfonylcarboxylic acids as potent matrix metalloproteinase inhibitors. Bioorg Med Chem Lett16:3096-100 (2006) 
 
Matrix metalloproteinase-9
Name:Matrix metalloproteinase-9
Type:Enzyme
Mol. Mass.:78452.28
Organism:Homo sapiens (Human)
Description:P14780
Residue:707
BDBM50185883
NameBDBM50185883
Synonyms:2-(4'-chloro-biphenyl-4-sulfonyl)-4-(1,3-dioxo-1,3-dihydro-isoindol-2-yl)-N-hydroxy-butyramide | CHEMBL382227
TypeSmall organic molecule
Emp. Form.C24H19ClN2O6S
Mol. Mass.498.935
SMILESONC(=O)C(CCN1C(=O)c2ccccc2C1=O)S(=O)(=O)c1ccc(cc1)-c1ccc(Cl)cc1