Reaction Details
TargetMatrix metalloproteinase-9
LigandBDBM50185888
Substrate/Competitorn/a
Meas. Tech.ChEMBL_361727 (CHEMBL870165)
IC50 0.800000±n/a nM
Citation Zhang, YMFan, XXiang, BChakravarty, DScannevin, RBurke, SKarnachi, PRhodes, KJackson, P Synthesis and SAR of alpha-sulfonylcarboxylic acids as potent matrix metalloproteinase inhibitors. Bioorg Med Chem Lett16:3096-100 (2006) 
 
Matrix metalloproteinase-9
Name:Matrix metalloproteinase-9
Type:Enzyme
Mol. Mass.:78452.28
Organism:Homo sapiens (Human)
Description:P14780
Residue:707
BDBM50185888
NameBDBM50185888
Synonyms:4-(1,3-dioxo-1,3-dihydro-isoindol-2-yl)-2-[4-(4-ethyl-phenylethynyl)-phenylsulfanyl]-butyric acid | CHEMBL379220
TypeSmall organic molecule
Emp. Form.C28H23NO4S
Mol. Mass.469.552
SMILESCCc1ccc(cc1)C#Cc1ccc(SC(CCN2C(=O)c3ccccc3C2=O)C(O)=O)cc1