Reaction Details
Target72 kDa type IV collagenase
LigandBDBM50185880
Substrate/Competitorn/a
Meas. Tech.ChEMBL_361726 (CHEMBL870164)
IC50 0.980000±n/a nM
Citation Zhang, YMFan, XXiang, BChakravarty, DScannevin, RBurke, SKarnachi, PRhodes, KJackson, P Synthesis and SAR of alpha-sulfonylcarboxylic acids as potent matrix metalloproteinase inhibitors. Bioorg Med Chem Lett16:3096-100 (2006) 
 
72 kDa type IV collagenase
Name:72 kDa type IV collagenase
Type:Enzyme
Mol. Mass.:73870.36
Organism:Homo sapiens (Human)
Description: P08253
Residue:660
BDBM50185880
NameBDBM50185880
Synonyms:4-(1,3-dioxo-1,3-dihydro-isoindol-2-yl)-2-(4'-isopropyl-biphenyl-4-sulfonyl)-butyric acid | CHEMBL383193
TypeSmall organic molecule
Emp. Form.C27H25NO6S
Mol. Mass.491.556
SMILESCC(C)c1ccc(cc1)-c1ccc(cc1)S(=O)(=O)C(CCN1C(=O)c2ccccc2C1=O)C(O)=O