Reaction Details
TargetProtein kinase C alpha type
LigandBDBM50185931
Substrate/Competitorn/a
Meas. Tech.ChEMBL_352174 (CHEMBL867849)
Ki>10000±n/a nM
Citation Nakagawa, YIrie, KYanagita, RCOhigashi, HTsuda, KKashiwagi, KSaito, N Design and synthesis of 8-octyl-benzolactam-V9, a selective activator for protein kinase C epsilon and eta. J Med Chem49:2681-8 (2006) 
 
Protein kinase C alpha type
Name:Protein kinase C alpha type
Type:Enzyme
Mol. Mass.:76755.65
Organism:Homo sapiens (Human)
Description:The recombinant human PKC enzymes were produced using a baculovirus expression system in SF9 cells
Residue:672
BDBM50185931
NameBDBM50185931
Synonyms:8-Octyl-benzolactam-V9 | CHEMBL206866
TypeSmall organic molecule
Emp. Form.C24H40N2O2
Mol. Mass.388.5866
SMILESCCCCCCCCc1cccc2N(C)[C@@H](C(C)C)C(=O)N[C@H](CO)CCc12