Reaction Details
TargetAmyloid-beta precursor protein
LigandBDBM50173647
Substrate/Competitorn/a
Meas. Tech.ChEMBL_353055 (CHEMBL866263)
Ki>3000±n/a nM
Citation Zhuang, ZPKung, MPKung, HF Synthesis of biphenyltrienes as probes for beta-amyloid plaques. J Med Chem49:2841-4 (2006) 
 
Amyloid-beta precursor protein
Name:Amyloid-beta precursor protein
Type:Single-pass type I membrane protein
Mol. Mass.:86890.41
Organism:Homo sapiens (Human)
Description:P05067
Residue:770
BDBM50173647
NameBDBM50173647
Synonyms:(E)-4-(4-(methylamino)styryl)phenol 4-N-methylamino-4'-hydroxystilbene CHEMBL381642 [3H]-4-(4-(methylamino)styryl)phenol
TypeSmall organic molecule
Emp. Form.C15H15NO
Mol. Mass.225.2857
SMILESCNc1ccc(\C=C\c2ccc(O)cc2)cc1