Reaction Details
TargetMelanocortin receptor 4
LigandBDBM50186128
Substrate/Competitorn/a
Meas. Tech.ChEMBL_371315 (CHEMBL865536)
Ki 5±n/a nM
Citation Briner, KCollado, IFisher, MJGarcía-Paredes, CHusain, SKuklish, SLMateo, AIO'Brien, TPOrnstein, PLZgombick, Jde Frutos, O Privileged structure based ligands for melanocortin-4 receptors--aliphatic piperazine derivatives. Bioorg Med Chem Lett16:3449-53 (2006) 
 
Melanocortin receptor 4
Name:Melanocortin receptor 4
Type:Enzyme
Mol. Mass.:36949.50
Organism:Homo sapiens (Human)
Description:P32245
Residue:332
BDBM50186128
NameBDBM50186128
Synonyms:CHEMBL209990 | N-((R)-3-(4-chlorophenyl)-1-(4-(1-cyclohexyl-2-(diethylamino)ethyl)piperazin-1-yl)-1-oxopropan-2-yl)-2-(indolin-2-yl)acetamide
TypeSmall organic molecule
Emp. Form.C35H50ClN5O2
Mol. Mass.608.257
SMILESCCN(CC)CC(C1CCCCC1)N1CCN(CC1)C(=O)[C@@H](Cc1ccc(Cl)cc1)NC(=O)CC1Cc2ccccc2N1