Reaction Details
TargetRNA-directed RNA polymerase
LigandBDBM50186180
Substrate/Competitorn/a
Meas. Tech.ChEMBL_369597 (CHEMBL865370)
IC50 10±n/a nM
Citation Chris Krueger, AMadigan, DLJiang, WWKati, WMLiu, DLiu, YMaring, CJMasse, SMcDaniel, KFMiddleton, TMo, HMolla, AMontgomery, DPratt, JKRockway, TWZhang, RKempf, DJ Inhibitors of HCV NS5B polymerase: synthesis and structure-activity relationships of N-alkyl-4-hydroxyquinolon-3-yl-benzothiadiazine sulfamides. Bioorg Med Chem Lett16:3367-70 (2006) 
 
RNA-directed RNA polymerase
Name:RNA-directed RNA polymerase
Type:Protein
Mol. Mass.:25173.95
Organism:Hepatitis C virus
Description:Q8JXU8
Residue:229
BDBM50186180
NameBDBM50186180
Synonyms:7-{[(2-aminoethyl)sulfamoyl]amino}-3-[4-hydroxy-1-(3-methylbutyl)-2-oxo-1,2-dihydro-1,8-naphthyridin-3-yl]-4H-1,2,4-benzothiadiazine-1,1-dione | CHEMBL210671
TypeSmall organic molecule
Emp. Form.C22H27N7O6S2
Mol. Mass.549.623
SMILESCC(C)CCn1c2ncccc2c(O)c(C2=Nc3ccc(NS(=O)(=O)NCCN)cc3S(=O)(=O)N2)c1=O