Reaction Details
TargetSubstance-P receptor
LigandBDBM50186527
Substrate/Competitorn/a
Meas. Tech.ChEMBL_377172 (CHEMBL869696)
Ki 0.02±n/a nM
Citation Wrobleski, MLReichard, GAPaliwal, SShah, STsui, HCDuffy, RALachowicz, JEMorgan, CAVarty, GBShih, NY Cyclobutane derivatives as potent NK1 selective antagonists. Bioorg Med Chem Lett16:3859-63 (2006) 
 
Substance-P receptor
Name:Substance-P receptor
Type:G Protein-Coupled Receptor (GPCR)
Mol. Mass.:46254.43
Organism:Homo sapiens (Human)
Description:P25103
Residue:407
BDBM50186527
NameBDBM50186527
Synonyms:(R)-3-((1-(3,5-bis(trifluoromethyl)phenyl)ethoxy)methyl)-3-phenylcyclobutanamine | CHEMBL212428
TypeSmall organic molecule
Emp. Form.C21H21F6NO
Mol. Mass.417.388
SMILESC[C@@H](OCC1(CC(N)C1)c1ccccc1)c1cc(cc(c1)C(F)(F)F)C(F)(F)F