Reaction Details
TargetAryl hydrocarbon receptor
LigandBDBM50605060
Substrate/Competitorn/a
Meas. Tech.ChEMBL_2250271 (CHEMBL5164481)
EC50 1.6±n/a nM
Citation Grycová, AJoo, HMaier, VIllés, PVyhlídalová, BPoulíková, KSládeková, LNádvorník, PVrzal, RZemánková, LPe?inková, PPoruba, MZapletalová, IVe?e?a, RAnzenbacher, PEhrmann, JOndra, PJung, JWMani, SDvo?ák, Z Targeting the Aryl Hydrocarbon Receptor with Microbial Metabolite Mimics Alleviates Experimental Colitis in Mice. J Med Chem65:6859-6868 (2022) 
 
Aryl hydrocarbon receptor
Name:Aryl hydrocarbon receptor
Type:PROTEIN
Mol. Mass.:96143.77
Organism:Homo sapiens (Human)
Description:ChEMBL_1503828
Residue:848
BDBM50605060
NameBDBM50605060
Synonyms:CHEMBL5198290 | US11891386, Compound 004
TypeSmall organic molecule
Emp. Form.C14H11N3O2S
Mol. Mass.285.321
SMILESCNC(=O)c1csc(n1)C(=O)c1c[nH]c2ccccc12