Reaction Details
TargetMelanin-concentrating hormone receptor 1
LigandBDBM50186779
Substrate/Competitorn/a
Meas. Tech.ChEMBL_376788 (CHEMBL867266)
Ki 9±n/a nM
Citation Wu, WLBurnett, DASpring, RQiang, LSasikumar, TKDomalski, MSGreenlee, WJO'Neill, KHawes, BE Synthesis and structure-activity relationships of piperidine-based melanin-concentrating hormone receptor 1 antagonists. Bioorg Med Chem Lett16:3668-73 (2006) 
 
Melanin-concentrating hormone receptor 1
Name:Melanin-concentrating hormone receptor 1
Type:G Protein-Coupled Receptor (GPCR)
Mol. Mass.:45976.27
Organism:Homo sapiens (Human)
Description:Membranes from CHO-K1 cells stably expressing human MCH1R were used in assays.
Residue:422
BDBM50186779
NameBDBM50186779
Synonyms:2-{[4-(3'-cyano-biphenyl-4-yl)-1-cyclopentyl-piperidin-4-yl]-methyl-amino}-N-(3,5-dichloro-phenyl)-acetamide | CHEMBL378994
TypeSmall organic molecule
Emp. Form.C32H34Cl2N4O
Mol. Mass.561.545
SMILESCN(CC(=O)Nc1cc(Cl)cc(Cl)c1)C1(CCN(CC1)C1CCCC1)c1ccc(cc1)-c1cccc(c1)C#N