Reaction Details
TargetMelanin-concentrating hormone receptor 2
LigandBDBM50186813
Substrate/Competitorn/a
Meas. Tech.ChEMBL_376789 (CHEMBL866614)
Ki>3000±n/a nM
Citation Wu, WLBurnett, DASpring, RQiang, LSasikumar, TKDomalski, MSGreenlee, WJO'Neill, KHawes, BE Synthesis and structure-activity relationships of piperidine-based melanin-concentrating hormone receptor 1 antagonists. Bioorg Med Chem Lett16:3668-73 (2006) 
 
Melanin-concentrating hormone receptor 2
Name:Melanin-concentrating hormone receptor 2
Type:Enzyme Catalytic Domain
Mol. Mass.:38862.16
Organism:Homo sapiens (Human)
Description:Melanin Concentrating Hormone 2 GPR145 HUMAN::Q969V1
Residue:340
BDBM50186813
NameBDBM50186813
Synonyms:3-[4-(3'-cyano-biphenyl-4-yl)-1-cyclopropylmethyl-piperidin-4-yl]-N-(3,4-difluoro-phenyl)-propionamide | CHEMBL212265
TypeSmall organic molecule
Emp. Form.C31H31F2N3O
Mol. Mass.499.5941
SMILESFc1ccc(NC(=O)CCC2(CCN(CC3CC3)CC2)c2ccc(cc2)-c2cccc(c2)C#N)cc1F