Reaction Details
TargetMelanocortin receptor 4
LigandBDBM50186863
Substrate/Competitorn/a
Meas. Tech.ChEMBL_376512 (CHEMBL869042)
Ki 5±n/a nM
Citation Kuklish, SLBacker, RTBriner, KDoecke, CWHusain, SMullaney, JTOrnstein, PLZgombick, JMO'Brien, TPFisher, MJ Privileged structure based ligands for melanocortin receptors--4,4-disubstituted piperidine derivatives. Bioorg Med Chem Lett16:3843-6 (2006) 
 
Melanocortin receptor 4
Name:Melanocortin receptor 4
Type:Enzyme
Mol. Mass.:36949.50
Organism:Homo sapiens (Human)
Description:P32245
Residue:332
BDBM50186863
NameBDBM50186863
Synonyms:CHEMBL379497 | N-((R)-3-(4-chlorophenyl)-1-(4-(1-cyclohexyl-3-(diethylamino)propan-2-yl)piperazin-1-yl)-1-oxopropan-2-yl)-2-(isoindolin-1-yl)acetamide
TypeSmall organic molecule
Emp. Form.C36H52ClN5O2
Mol. Mass.622.283
SMILESCCN(CC)CC(CC1CCCCC1)N1CCN(CC1)C(=O)[C@@H](Cc1ccc(Cl)cc1)NC(=O)CC1NCc2ccccc12