Reaction Details
Target5-hydroxytryptamine receptor 1A
LigandBDBM50187389
Substrate/Competitorn/a
Meas. Tech.ChEMBL_357738 (CHEMBL870197)
Ki 8.9±n/a nM
Citation Becker, OMDhanoa, DSMarantz, YChen, DShacham, SCheruku, SHeifetz, AMohanty, PFichman, MSharadendu, ANudelman, RKauffman, MNoiman, S An integrated in silico 3D model-driven discovery of a novel, potent, and selective amidosulfonamide 5-HT1A agonist (PRX-00023) for the treatment of anxiety and depression. J Med Chem49:3116-35 (2006) 
 
5-hydroxytryptamine receptor 1A
Name:5-hydroxytryptamine receptor 1A
Type:n/a
Mol. Mass.:46122.49
Organism:Homo sapiens (Human)
Description:n/a
Residue:422
BDBM50187389
NameBDBM50187389
Synonyms:CHEMBL377697 | cyclopropanecarboxylic acid {3-[4-(4-cyclohexylmethanesulfonylamino-butyl)-piperazin-1-yl]-phenyl}-amide
TypeSmall organic molecule
Emp. Form.C25H40N4O3S
Mol. Mass.476.675
SMILESO=C(Nc1cccc(c1)N1CCN(CCCCNS(=O)(=O)CC2CCCCC2)CC1)C1CC1