Reaction Details
Target5-hydroxytryptamine receptor 1A
LigandBDBM50187394
Substrate/Competitorn/a
Meas. Tech.ChEMBL_357738 (CHEMBL870197)
Ki 1.3±n/a nM
Citation Becker, OMDhanoa, DSMarantz, YChen, DShacham, SCheruku, SHeifetz, AMohanty, PFichman, MSharadendu, ANudelman, RKauffman, MNoiman, S An integrated in silico 3D model-driven discovery of a novel, potent, and selective amidosulfonamide 5-HT1A agonist (PRX-00023) for the treatment of anxiety and depression. J Med Chem49:3116-35 (2006) 
 
5-hydroxytryptamine receptor 1A
Name:5-hydroxytryptamine receptor 1A
Type:n/a
Mol. Mass.:46122.49
Organism:Homo sapiens (Human)
Description:n/a
Residue:422
BDBM50187394
NameBDBM50187394
Synonyms:CHEMBL207220 | N-(3-{4-[4-(cyclohexylmethanesulfonyl-methyl-amino)-butyl]-piperazin-1-yl}-phenyl)-acetamide
TypeSmall organic molecule
Emp. Form.C24H40N4O3S
Mol. Mass.464.664
SMILESCN(CCCCN1CCN(CC1)c1cccc(NC(C)=O)c1)S(=O)(=O)CC1CCCCC1