Reaction Details
TargetMatrix metalloproteinase-9
LigandBDBM23500
Substrate/Competitorn/a
Meas. Tech.ChEMBL_377987 (CHEMBL866143)
IC50 1670±n/a nM
Citation Park, KAplasca, ADu, MTSun, LZhu, YZhang, YLevin, JI Design and synthesis of butynyloxyphenyl beta-sulfone piperidine hydroxamates as TACE inhibitors. Bioorg Med Chem Lett16:3927-31 (2006) 
 
Matrix metalloproteinase-9
Name:Matrix metalloproteinase-9
Type:Enzyme
Mol. Mass.:78452.28
Organism:Homo sapiens (Human)
Description:P14780
Residue:707
BDBM23500
NameBDBM23500
Synonyms:4-({[4-(but-2-yn-1-yloxy)benzene]sulfonyl}methyl)-N-hydroxy-1-(propane-2-sulfonyl)piperidine-4-carboxamide beta-sulfonyl hydroxamate analogue, 4
TypeSmall organic molecule
Emp. Form.C20H28N2O7S2
Mol. Mass.472.576
SMILESCC#CCOc1ccc(cc1)S(=O)(=O)CC1(CCN(CC1)S(=O)(=O)C(C)C)C(=O)NO