Reaction Details
TargetMatrix metalloproteinase-14
LigandBDBM50187789
Substrate/Competitorn/a
Meas. Tech.ChEMBL_377989 (CHEMBL867338)
IC50 97±n/a nM
Citation Park, KAplasca, ADu, MTSun, LZhu, YZhang, YLevin, JI Design and synthesis of butynyloxyphenyl beta-sulfone piperidine hydroxamates as TACE inhibitors. Bioorg Med Chem Lett16:3927-31 (2006) 
 
Matrix metalloproteinase-14
Name:Matrix metalloproteinase-14
Type:Protein
Mol. Mass.:65900.19
Organism:Homo sapiens (Human)
Description:P50281
Residue:582
BDBM50187789
NameBDBM50187789
Synonyms:1-(2-aminobenzoyl)-4-((4-(but-2-ynyloxy)phenylsulfonyl)methyl)-N-hydroxypiperidine-4-carboxamide | CHEMBL212411
TypeSmall organic molecule
Emp. Form.C24H27N3O6S
Mol. Mass.485.553
SMILESCC#CCOc1ccc(cc1)S(=O)(=O)CC1(CCN(CC1)C(=O)c1ccccc1N)C(=O)NO