Reaction Details
TargetMatrix metalloproteinase-14
LigandBDBM50187795
Substrate/Competitorn/a
Meas. Tech.ChEMBL_377989 (CHEMBL867338)
IC50 553±n/a nM
Citation Park, KAplasca, ADu, MTSun, LZhu, YZhang, YLevin, JI Design and synthesis of butynyloxyphenyl beta-sulfone piperidine hydroxamates as TACE inhibitors. Bioorg Med Chem Lett16:3927-31 (2006) 
 
Matrix metalloproteinase-14
Name:Matrix metalloproteinase-14
Type:Protein
Mol. Mass.:65900.19
Organism:Homo sapiens (Human)
Description:P50281
Residue:582
BDBM50187795
NameBDBM50187795
Synonyms:4-((4-(but-2-ynyloxy)phenylsulfonyl)methyl)-N-hydroxy-1-isonicotinoylpiperidine-4-carboxamide | CHEMBL377317
TypeSmall organic molecule
Emp. Form.C23H25N3O6S
Mol. Mass.471.526
SMILESCC#CCOc1ccc(cc1)S(=O)(=O)CC1(CCN(CC1)C(=O)c1ccncc1)C(=O)NO