Reaction Details
TargetMatrix metalloproteinase-14
LigandBDBM30140
Substrate/Competitorn/a
Meas. Tech.ChEMBL_377989 (CHEMBL867338)
IC50 963±n/a nM
Citation Park, KAplasca, ADu, MTSun, LZhu, YZhang, YLevin, JI Design and synthesis of butynyloxyphenyl beta-sulfone piperidine hydroxamates as TACE inhibitors. Bioorg Med Chem Lett16:3927-31 (2006) 
 
Matrix metalloproteinase-14
Name:Matrix metalloproteinase-14
Type:Protein
Mol. Mass.:65900.19
Organism:Homo sapiens (Human)
Description:P50281
Residue:582
BDBM30140
NameBDBM30140
Synonyms:CHEMBL380049 | beta-sulfone piperidine hydroxamate, 2b
TypeSmall organic molecule
Emp. Form.C19H24N2O6S
Mol. Mass.408.469
SMILESCC#CCOc1ccc(cc1)S(=O)(=O)CC1(CCN(CC1)C(C)=O)C(=O)NO