Reaction Details
TargetMatrix metalloproteinase-9
LigandBDBM50187782
Substrate/Competitorn/a
Meas. Tech.ChEMBL_377987 (CHEMBL866143)
IC50 879±n/a nM
Citation Park, KAplasca, ADu, MTSun, LZhu, YZhang, YLevin, JI Design and synthesis of butynyloxyphenyl beta-sulfone piperidine hydroxamates as TACE inhibitors. Bioorg Med Chem Lett16:3927-31 (2006) 
 
Matrix metalloproteinase-9
Name:Matrix metalloproteinase-9
Type:Enzyme
Mol. Mass.:78452.28
Organism:Homo sapiens (Human)
Description:P14780
Residue:707
BDBM50187782
NameBDBM50187782
Synonyms:4-((4-(but-2-ynyloxy)phenylsulfonyl)methyl)-N-hydroxy-1-(2-morpholinoacetyl)piperidine-4-carboxamide | CHEMBL208841
TypeSmall organic molecule
Emp. Form.C23H31N3O7S
Mol. Mass.493.573
SMILESCC#CCOc1ccc(cc1)S(=O)(=O)CC1(CCN(CC1)C(=O)CN1CCOCC1)C(=O)NO