Reaction Details
TargetDisintegrin and metalloproteinase domain-containing protein 17
LigandBDBM50187786
Substrate/Competitorn/a
Meas. Tech.ChEMBL_377971 (CHEMBL868588)
IC50<1±n/a nM
Citation Park, KAplasca, ADu, MTSun, LZhu, YZhang, YLevin, JI Design and synthesis of butynyloxyphenyl beta-sulfone piperidine hydroxamates as TACE inhibitors. Bioorg Med Chem Lett16:3927-31 (2006) 
 
Disintegrin and metalloproteinase domain-containing protein 17
Name:Disintegrin and metalloproteinase domain-containing protein 17
Type:Enzyme
Mol. Mass.:93007.89
Organism:Homo sapiens (Human)
Description:
Residue:824
BDBM50187786
NameBDBM50187786
Synonyms:4-((4-(but-2-ynyloxy)phenylsulfonyl)methyl)-N-hydroxy-1-(thiophene-2-carbonyl)piperidine-4-carboxamide | CHEMBL211770
TypeSmall organic molecule
Emp. Form.C22H24N2O6S2
Mol. Mass.476.566
SMILESCC#CCOc1ccc(cc1)S(=O)(=O)CC1(CCN(CC1)C(=O)c1cccs1)C(=O)NO