Reaction Details
TargetCollagenase 3
LigandBDBM50187779
Substrate/Competitorn/a
Meas. Tech.ChEMBL_377988 (CHEMBL867337)
IC50 74±n/a nM
Citation Park, KAplasca, ADu, MTSun, LZhu, YZhang, YLevin, JI Design and synthesis of butynyloxyphenyl beta-sulfone piperidine hydroxamates as TACE inhibitors. Bioorg Med Chem Lett16:3927-31 (2006) 
 
Collagenase 3
Name:Collagenase 3
Type:Enzyme
Mol. Mass.:53808.06
Organism:Homo sapiens (Human)
Description:P45452
Residue:471
BDBM50187779
NameBDBM50187779
Synonyms:4-((4-(but-2-ynyloxy)phenylsulfonyl)methyl)-N1,N1-diethyl-N4-hydroxypiperidine-1,4-dicarboxamide | CHEMBL379287
TypeSmall organic molecule
Emp. Form.C22H31N3O6S
Mol. Mass.465.563
SMILESCCN(CC)C(=O)N1CCC(CS(=O)(=O)c2ccc(OCC#CC)cc2)(CC1)C(=O)NO