Reaction Details
TargetDisintegrin and metalloproteinase domain-containing protein 17
LigandBDBM50187787
Substrate/Competitorn/a
Meas. Tech.ChEMBL_377971 (CHEMBL868588)
IC50 4.8±n/a nM
Citation Park, KAplasca, ADu, MTSun, LZhu, YZhang, YLevin, JI Design and synthesis of butynyloxyphenyl beta-sulfone piperidine hydroxamates as TACE inhibitors. Bioorg Med Chem Lett16:3927-31 (2006) 
 
Disintegrin and metalloproteinase domain-containing protein 17
Name:Disintegrin and metalloproteinase domain-containing protein 17
Type:Enzyme
Mol. Mass.:93007.89
Organism:Homo sapiens (Human)
Description:
Residue:824
BDBM50187787
NameBDBM50187787
Synonyms:1-(but-2-ynyl)-4-((4-(but-2-ynyloxy)phenylsulfonyl)methyl)-N-hydroxypiperidine-4-carboxamide | CHEMBL209490
TypeSmall organic molecule
Emp. Form.C21H26N2O5S
Mol. Mass.418.507
SMILESCC#CCOc1ccc(cc1)S(=O)(=O)CC1(CCN(CC#CC)CC1)C(=O)NO