Reaction Details
Target72 kDa type IV collagenase
LigandBDBM50187789
Substrate/Competitorn/a
Meas. Tech.ChEMBL_377986 (CHEMBL869795)
IC50 16±n/a nM
Citation Park, KAplasca, ADu, MTSun, LZhu, YZhang, YLevin, JI Design and synthesis of butynyloxyphenyl beta-sulfone piperidine hydroxamates as TACE inhibitors. Bioorg Med Chem Lett16:3927-31 (2006) 
 
72 kDa type IV collagenase
Name:72 kDa type IV collagenase
Type:Enzyme
Mol. Mass.:73870.36
Organism:Homo sapiens (Human)
Description: P08253
Residue:660
BDBM50187789
NameBDBM50187789
Synonyms:1-(2-aminobenzoyl)-4-((4-(but-2-ynyloxy)phenylsulfonyl)methyl)-N-hydroxypiperidine-4-carboxamide | CHEMBL212411
TypeSmall organic molecule
Emp. Form.C24H27N3O6S
Mol. Mass.485.553
SMILESCC#CCOc1ccc(cc1)S(=O)(=O)CC1(CCN(CC1)C(=O)c1ccccc1N)C(=O)NO