Reaction Details
TargetCollagenase 3
LigandBDBM50187795
Substrate/Competitorn/a
Meas. Tech.ChEMBL_377988 (CHEMBL867337)
IC50 21±n/a nM
Citation Park, KAplasca, ADu, MTSun, LZhu, YZhang, YLevin, JI Design and synthesis of butynyloxyphenyl beta-sulfone piperidine hydroxamates as TACE inhibitors. Bioorg Med Chem Lett16:3927-31 (2006) 
 
Collagenase 3
Name:Collagenase 3
Type:Enzyme
Mol. Mass.:53808.06
Organism:Homo sapiens (Human)
Description:P45452
Residue:471
BDBM50187795
NameBDBM50187795
Synonyms:4-((4-(but-2-ynyloxy)phenylsulfonyl)methyl)-N-hydroxy-1-isonicotinoylpiperidine-4-carboxamide | CHEMBL377317
TypeSmall organic molecule
Emp. Form.C23H25N3O6S
Mol. Mass.471.526
SMILESCC#CCOc1ccc(cc1)S(=O)(=O)CC1(CCN(CC1)C(=O)c1ccncc1)C(=O)NO