Reaction Details
TargetInterstitial collagenase
LigandBDBM50187790
Substrate/Competitorn/a
Meas. Tech.ChEMBL_377985 (CHEMBL866144)
IC50 5460±n/a nM
Citation Park, KAplasca, ADu, MTSun, LZhu, YZhang, YLevin, JI Design and synthesis of butynyloxyphenyl beta-sulfone piperidine hydroxamates as TACE inhibitors. Bioorg Med Chem Lett16:3927-31 (2006) 
 
Interstitial collagenase
Name:Interstitial collagenase
Type:Enzyme
Mol. Mass.:54010.26
Organism:Homo sapiens (Human)
Description: P03956
Residue:469
BDBM50187790
NameBDBM50187790
Synonyms:4-((4-(but-2-ynyloxy)phenylsulfonyl)methyl)-1-hexanoyl-N-hydroxypiperidine-4-carboxamide | CHEMBL212205
TypeSmall organic molecule
Emp. Form.C23H32N2O6S
Mol. Mass.464.575
SMILESCCCCCC(=O)N1CCC(CS(=O)(=O)c2ccc(OCC#CC)cc2)(CC1)C(=O)NO