Reaction Details
Target72 kDa type IV collagenase
LigandBDBM30144
Substrate/Competitorn/a
Meas. Tech.ChEMBL_377986 (CHEMBL869795)
IC50 62±n/a nM
Citation Park, KAplasca, ADu, MTSun, LZhu, YZhang, YLevin, JI Design and synthesis of butynyloxyphenyl beta-sulfone piperidine hydroxamates as TACE inhibitors. Bioorg Med Chem Lett16:3927-31 (2006) 
 
72 kDa type IV collagenase
Name:72 kDa type IV collagenase
Type:Enzyme
Mol. Mass.:73870.36
Organism:Homo sapiens (Human)
Description: P08253
Residue:660
BDBM30144
NameBDBM30144
Synonyms:CHEMBL212481 | beta-sulfone piperidine hydroxamate, 2c
TypeSmall organic molecule
Emp. Form.C24H26N2O6S
Mol. Mass.470.538
SMILESCC#CCOc1ccc(cc1)S(=O)(=O)CC1(CCN(CC1)C(=O)c1ccccc1)C(=O)NO