Reaction Details
Target72 kDa type IV collagenase
LigandBDBM50187788
Substrate/Competitorn/a
Meas. Tech.ChEMBL_377986 (CHEMBL869795)
IC50 54±n/a nM
Citation Park, KAplasca, ADu, MTSun, LZhu, YZhang, YLevin, JI Design and synthesis of butynyloxyphenyl beta-sulfone piperidine hydroxamates as TACE inhibitors. Bioorg Med Chem Lett16:3927-31 (2006) 
 
72 kDa type IV collagenase
Name:72 kDa type IV collagenase
Type:Enzyme
Mol. Mass.:73870.36
Organism:Homo sapiens (Human)
Description: P08253
Residue:660
BDBM50187788
NameBDBM50187788
Synonyms:4-((4-(but-2-ynyloxy)phenylsulfonyl)methyl)-N-hydroxy-1-(3-hydroxy-2-(hydroxymethyl)-2-methylpropanoyl)piperidine-4-carboxamide | CHEMBL211274
TypeSmall organic molecule
Emp. Form.C22H30N2O8S
Mol. Mass.482.547
SMILESCC#CCOc1ccc(cc1)S(=O)(=O)CC1(CCN(CC1)C(=O)C(C)(CO)CO)C(=O)NO