Reaction Details
Target72 kDa type IV collagenase
LigandBDBM23500
Substrate/Competitorn/a
Meas. Tech.ChEMBL_377986 (CHEMBL869795)
IC50 355±n/a nM
Citation Park, KAplasca, ADu, MTSun, LZhu, YZhang, YLevin, JI Design and synthesis of butynyloxyphenyl beta-sulfone piperidine hydroxamates as TACE inhibitors. Bioorg Med Chem Lett16:3927-31 (2006) 
 
72 kDa type IV collagenase
Name:72 kDa type IV collagenase
Type:Enzyme
Mol. Mass.:73870.36
Organism:Homo sapiens (Human)
Description: P08253
Residue:660
BDBM23500
NameBDBM23500
Synonyms:4-({[4-(but-2-yn-1-yloxy)benzene]sulfonyl}methyl)-N-hydroxy-1-(propane-2-sulfonyl)piperidine-4-carboxamide beta-sulfonyl hydroxamate analogue, 4
TypeSmall organic molecule
Emp. Form.C20H28N2O7S2
Mol. Mass.472.576
SMILESCC#CCOc1ccc(cc1)S(=O)(=O)CC1(CCN(CC1)S(=O)(=O)C(C)C)C(=O)NO