Reaction Details
TargetDisintegrin and metalloproteinase domain-containing protein 17
LigandBDBM50187796
Substrate/Competitorn/a
Meas. Tech.ChEMBL_377971 (CHEMBL868588)
IC50 2.2±n/a nM
Citation Park, KAplasca, ADu, MTSun, LZhu, YZhang, YLevin, JI Design and synthesis of butynyloxyphenyl beta-sulfone piperidine hydroxamates as TACE inhibitors. Bioorg Med Chem Lett16:3927-31 (2006) 
 
Disintegrin and metalloproteinase domain-containing protein 17
Name:Disintegrin and metalloproteinase domain-containing protein 17
Type:Enzyme
Mol. Mass.:93007.89
Organism:Homo sapiens (Human)
Description:
Residue:824
BDBM50187796
NameBDBM50187796
Synonyms:4-((4-(but-2-ynyloxy)phenylsulfonyl)methyl)-1-butyryl-N-hydroxypiperidine-4-carboxamide | CHEMBL211487
TypeSmall organic molecule
Emp. Form.C21H28N2O6S
Mol. Mass.436.522
SMILESCCCC(=O)N1CCC(CS(=O)(=O)c2ccc(OCC#CC)cc2)(CC1)C(=O)NO