Reaction Details
TargetGalanin receptor type 3
LigandBDBM50187923
Substrate/Competitorn/a
Meas. Tech.ChEMBL_384498 (CHEMBL866716)
Ki 17±n/a nM
Citation Konkel, MJPackiarajan, MChen, HTopiwala, UPJimenez, HTalisman, IJCoate, HWalker, MW Amino substituted analogs of 1-phenyl-3-phenylimino-2-indolones with potent galanin Gal3 receptor binding affinity and improved solubility. Bioorg Med Chem Lett16:3950-4 (2006) 
 
Galanin receptor type 3
Name:Galanin receptor type 3
Type:Enzyme Catalytic Domain
Mol. Mass.:39599.97
Organism:Homo sapiens (Human)
Description:Galanin R3 GALR3 HUMAN::O60755
Residue:368
BDBM50187923
NameBDBM50187923
Synonyms:1,3-dihydro-1-phenyl-3-[[3-(trilfluoromethyl)phenyl]imino]-2H-indol-2-one CHEMBL210288
TypeSmall organic molecule
Emp. Form.C21H13F3N2O
Mol. Mass.366.3359
SMILESFC(F)(F)c1cccc(c1)\N=C1\C(=O)N(c2ccccc12)c1ccccc1