Reaction Details
TargetEstrogen receptor beta
LigandBDBM50187941
Substrate/Competitorn/a
Meas. Tech.ChEMBL_383639 (CHEMBL868002)
IC50 0.8±n/a nM
Citation Wilkening, RRRatcliffe, RWFried, AKMeng, DSun, WColwell, LLambert, SGreenlee, MNilsson, SThorsell, AMojena, MTudela, CFrisch, KChan, WBirzin, ETRohrer, SPHammond, ML Estrogen receptor beta-subtype selective tetrahydrofluorenones: use of a fused pyrazole as a phenol bioisostere. Bioorg Med Chem Lett16:3896-901 (2006) 
 
Estrogen receptor beta
Name:Estrogen receptor beta
Type:Protein
Mol. Mass.:59238.43
Organism:Homo sapiens (Human)
Description:Q92731
Residue:530
BDBM50187941
NameBDBM50187941
Synonyms:(S)-9a-butyl-6-(trifluoromethyl)-8,9,9a,10-tetrahydroindeno[2,1-e]indazol-7(3H)-one | CHEMBL377644
TypeSmall organic molecule
Emp. Form.C19H19F3N2O
Mol. Mass.348.3622
SMILESCCCC[C@]12Cc3c(ccc4[nH]ncc34)C1=C(C(=O)CC2)C(F)(F)F