Reaction Details
TargetEstrogen receptor beta
LigandBDBM50187949
Substrate/Competitorn/a
Meas. Tech.ChEMBL_383644 (CHEMBL867408)
EC50 1.7±n/a nM
Citation Wilkening, RRRatcliffe, RWFried, AKMeng, DSun, WColwell, LLambert, SGreenlee, MNilsson, SThorsell, AMojena, MTudela, CFrisch, KChan, WBirzin, ETRohrer, SPHammond, ML Estrogen receptor beta-subtype selective tetrahydrofluorenones: use of a fused pyrazole as a phenol bioisostere. Bioorg Med Chem Lett16:3896-901 (2006) 
 
Estrogen receptor beta
Name:Estrogen receptor beta
Type:Protein
Mol. Mass.:59238.43
Organism:Homo sapiens (Human)
Description:Q92731
Residue:530
BDBM50187949
NameBDBM50187949
Synonyms:CHEMBL211953 | rac-6,9a-diethyl-8,9,9a,10-tetrahydroindeno[2,1-e]indazol-7(3H)-one
TypeSmall organic molecule
Emp. Form.C18H20N2O
Mol. Mass.280.3642
SMILESCCC1=C2c3ccc4[nH]ncc4c3CC2(CC)CCC1=O