Reaction Details
TargetEstrogen receptor beta
LigandBDBM50187954
Substrate/Competitorn/a
Meas. Tech.ChEMBL_383639 (CHEMBL868002)
IC50 0.3±n/a nM
Citation Wilkening, RRRatcliffe, RWFried, AKMeng, DSun, WColwell, LLambert, SGreenlee, MNilsson, SThorsell, AMojena, MTudela, CFrisch, KChan, WBirzin, ETRohrer, SPHammond, ML Estrogen receptor beta-subtype selective tetrahydrofluorenones: use of a fused pyrazole as a phenol bioisostere. Bioorg Med Chem Lett16:3896-901 (2006) 
 
Estrogen receptor beta
Name:Estrogen receptor beta
Type:Protein
Mol. Mass.:59238.43
Organism:Homo sapiens (Human)
Description:Q92731
Residue:530
BDBM50187954
NameBDBM50187954
Synonyms:(S)-9a-ethyl-1-fluoro-6-(trifluoromethyl)-8,9,9a,10-tetrahydroindeno[2,1-e]indazol-7(3H)-one | CHEMBL385680
TypeSmall organic molecule
Emp. Form.C17H14F4N2O
Mol. Mass.338.2995
SMILESCC[C@]12Cc3c(ccc4n[nH]c(F)c34)C1=C(C(=O)CC2)C(F)(F)F