Reaction Details
TargetEstrogen receptor
LigandBDBM50187964
Substrate/Competitorn/a
Meas. Tech.ChEMBL_383638 (CHEMBL868001)
IC50 46±n/a nM
Citation Wilkening, RRRatcliffe, RWFried, AKMeng, DSun, WColwell, LLambert, SGreenlee, MNilsson, SThorsell, AMojena, MTudela, CFrisch, KChan, WBirzin, ETRohrer, SPHammond, ML Estrogen receptor beta-subtype selective tetrahydrofluorenones: use of a fused pyrazole as a phenol bioisostere. Bioorg Med Chem Lett16:3896-901 (2006) 
 
Estrogen receptor
Name:Estrogen receptor
Type:Protein
Mol. Mass.:66230.44
Organism:Homo sapiens (Human)
Description:P03372
Residue:595
BDBM50187964
NameBDBM50187964
Synonyms:(S)-9a-ethyl-6-phenyl-8,9,9a,10-tetrahydroindeno[2,1-e]indazol-7(3H)-one | CHEMBL211349
TypeSmall organic molecule
Emp. Form.C22H20N2O
Mol. Mass.328.407
SMILESCC[C@]12Cc3c(ccc4[nH]ncc34)C1=C(C(=O)CC2)c1ccccc1